【友盟+】开发者社区

6.0.4统计集成

woniu0936 发表于 2016-12-15 14:32:51 |

woniu0936
woniu0936 发表于 2016-12-15 14:31:21 | 显示全部楼层 |阅读模式
14:27:46.274 [ERROR] [org.gradle.BuildExceptionReporter]
14:27:46.274 [ERROR] [org.gradle.BuildExceptionReporter] FAILURE: Build failed with an exception.
14:27:46.275 [ERROR] [org.gradle.BuildExceptionReporter]
14:27:46.275 [ERROR] [org.gradle.BuildExceptionReporter] * What went wrong:
14:27:46.275 [ERROR] [org.gradle.BuildExceptionReporter] A problem occurred configuring project ':app'.
14:27:46.275 [ERROR] [org.gradle.BuildExceptionReporter] > Could not resolve all dependencies for configuration ':app:_xiaomiDebugApkCopy'.
14:27:46.275 [ERROR] [org.gradle.BuildExceptionReporter]    > Could not find com.umeng.analytics:analytics:v6.0.4.
14:27:46.275 [ERROR] [org.gradle.BuildExceptionReporter]      Required by:
14:27:46.275 [ERROR] [org.gradle.BuildExceptionReporter]          say-android:app:unspecified
14:27:46.275 [ERROR] [org.gradle.BuildExceptionReporter]
14:27:46.275 [ERROR] [org.gradle.BuildExceptionReporter] * Try:
14:27:46.275 [ERROR] [org.gradle.BuildExceptionReporter] Run with --stacktrace option to get the stack trace.
14:27:46.276 [LIFECYCLE] [org.gradle.BuildResultLogger]
14:27:46.276 [LIFECYCLE] [org.gradle.BuildResultLogger] BUILD FAILED
14:27:46.276 [LIFECYCLE] [org.gradle.BuildResultLogger]




上一篇:友盟分析抛出以下异常
下一篇:页面访问路径


高级模式
B Color Image Link Quote Code Smilies |上传

本版积分规则

发表主题

精彩推荐

社会化分享SDK无法下载
今天本来想集成下分享的,结果发现页面的上下载按钮仿佛是个摆设
iOS11微信分享出问题
微信是最新版本 6.5.12 SDK版本是6.4.5 同型号测试机iOS10微信分享没问题,另一个测试机安装了iOS11微信
图标统计不显示,文字统计的可以是什么原因
这个站点上有图片的显示一个都显示不出来,“站长统计”这个文字的却可以显示,是什么原因??? 只有这一

关注我们

新浪微博
微信

欢迎关注友盟官方微博微信!

在线客服
返回顶部 返回列表